Reaction Details
TargetPeroxisome proliferator-activated receptor delta
LigandBDBM50103946
Substrate/Competitorn/a
Meas. Tech.ChEMBL_153498 (CHEMBL760304)
EC50 160±n/a nM
Citation Liu, KGSmith, JSAyscue, AHHenke, BRLambert, MHLeesnitzer, LMPlunket, KDWillson, TMSternbach, DD Identification of a series of oxadiazole-substituted alpha-isopropoxy phenylpropanoic acids with activity on PPARalpha, PPARgamma, and PPARdelta. Bioorg Med Chem Lett11:2385-8 (2001) Peroxisome proliferator-activated receptor delta
Name:Peroxisome proliferator-activated receptor delta
Type:Enzyme
Mol. Mass.:49910.45
Organism:Homo sapiens (Human)
Description:Q03181
Residue:441
BDBM50103946
NameBDBM50103946
Synonyms:3-(4-((5-(3,5-difluorophenyl)-1,2,4-oxadiazol-3-yl)methoxy)phenyl)-2-isopropoxypropanoic acid CHEMBL309778
TypeSmall organic molecule
Emp. Form.C21H20F2N2O5
Mol. Mass.418.3907
SMILESCC(C)OC(Cc1ccc(OCc2noc(n2)-c2cc(F)cc(F)c2)cc1)C(O)=O