Reaction Details
TargetGonadotropin-releasing hormone receptor
LigandBDBM50104564
Substrate/Competitorn/a
Meas. Tech.ChEBML_71456
IC50 0.400000±n/a nM
Citation Ashton, WTSisco, RMKieczykowski, GRYang, YTYudkovitz, JBCui, JMount, GRRen, RNWu, TJShen, XLyons, KAMao, AHCarlin, JRKaranam, BVVincent, SHCheng, KGoulet, MT Orally bioavailable, indole-based nonpeptide GnRH receptor antagonists with high potency and functional activity. Bioorg Med Chem Lett11:2597-602 (2001) Gonadotropin-releasing hormone receptor
Name:Gonadotropin-releasing hormone receptor
Type:Enzyme
Mol. Mass.:37749.45
Organism:Homo sapiens (Human)
Description:P30968
Residue:328
BDBM50104564
NameBDBM50104564
Synonyms:1-(1S,4R)-2-Aza-bicyclo[2.2.1]hept-2-yl-2-{2-(3,5-dimethyl-phenyl)-3-[(S)-1-methyl-2-(4-pyridin-4-yl-butylamino)-ethyl]-1H-indol-5-yl}-2-methyl-propan-1-one | CHEMBL315326
TypeSmall organic molecule
Emp. Form.C38H48N4O
Mol. Mass.576.8139
SMILESC[C@H](CNCCCCc1ccncc1)c1c([nH]c2ccc(cc12)C(C)(C)C(=O)N1C[C@@H]2CC[C@H]1C2)-c1cc(C)cc(C)c1