Reaction Details
TargetDual specificity protein phosphatase 3
LigandBDBM50104694
Substrate/Competitorn/a
Meas. Tech.ChEMBL_214524 (CHEMBL819516)
IC50 11600±n/a nM
Citation Sodeoka, MSampe, RKojima, SBaba, YUsui, TUeda, KOsada, H Synthesis of a tetronic acid library focused on inhibitors of tyrosine and dual-specificity protein phosphatases and its evaluation regarding VHR and cdc25B inhibition. J Med Chem44:3216-22 (2001) Dual specificity protein phosphatase 3
Name:Dual specificity protein phosphatase 3
Type:Hydrolase
Mol. Mass.:20480.58
Organism:Homo sapiens (Human)
Description:n/a
Residue:185
BDBM50104694
NameBDBM50104694
Synonyms:(R)-4-hydroxy-5-(hydroxymethyl)-3-palmitoylfuran-2(5H)-one 3-Hexadecanoyl-4-hydroxy-5-hydroxymethyl-5H-furan-2-one RK-682
TypeSmall organic molecule
Emp. Form.C21H36O5
Mol. Mass.368.5075
(=O)c1c(O)oc(CO)c1O