Reaction Details
TargetM-phase inducer phosphatase 2
LigandBDBM50104703
Substrate/Competitorn/a
Meas. Tech.ChEMBL_49038 (CHEMBL662076)
IC50 3300±n/a nM
Citation Sodeoka, MSampe, RKojima, SBaba, YUsui, TUeda, KOsada, H Synthesis of a tetronic acid library focused on inhibitors of tyrosine and dual-specificity protein phosphatases and its evaluation regarding VHR and cdc25B inhibition. J Med Chem44:3216-22 (2001) M-phase inducer phosphatase 2
Name:M-phase inducer phosphatase 2
Type:PROTEIN
Mol. Mass.:65485.87
Organism:Mus musculus
Description:ChEMBL_49038
Residue:576
BDBM50104703
NameBDBM50104703
Synonyms:4-Hydroxy-5-hydroxymethyl-2-oxo-2,5-dihydro-furan-3-carboxylic acid octadeca-9,12,15-trienyl ester | CHEMBL111387
TypeSmall organic molecule
Emp. Form.C24H36O6
Mol. Mass.420.539
SMILESCC\C=C\C\C=C\C\C=C\CCCCCCCCOC(=O)c1c(O)oc(CO)c1O