Reaction Details
TargetM-phase inducer phosphatase 2
LigandBDBM50104691
Substrate/Competitorn/a
Meas. Tech.ChEMBL_49038 (CHEMBL662076)
IC50 400±n/a nM
Citation Sodeoka, MSampe, RKojima, SBaba, YUsui, TUeda, KOsada, H Synthesis of a tetronic acid library focused on inhibitors of tyrosine and dual-specificity protein phosphatases and its evaluation regarding VHR and cdc25B inhibition. J Med Chem44:3216-22 (2001) M-phase inducer phosphatase 2
Name:M-phase inducer phosphatase 2
Type:PROTEIN
Mol. Mass.:65485.87
Organism:Mus musculus
Description:ChEMBL_49038
Residue:576
BDBM50104691
NameBDBM50104691
Synonyms:CHEMBL423508 | Diazo-[2-(4-hexadecanoyl-3-hydroxy-5-oxo-2,5-dihydro-furan-2-yl)-acetoxy]-acetic acid ethyl ester
TypeSmall organic molecule
Emp. Form.C26H40N2O8
Mol. Mass.508.6044
(=O)c1c(O)oc(CC(=O)O[C-]([N+]#N)C(=O)OCC)c1O