Reaction Details
TargetIntercellular adhesion molecule 1
LigandBDBM50105156
Substrate/Competitorn/a
Meas. Tech.ChEMBL_89061 (CHEMBL698941)
IC50 5±n/a nM
Citation Zhu, GDArendsen, DLGunawardana, IWBoyd, SAStewart, AOFry, DGCool, BLKifle, LSchaefer, VMeuth, JMarsh, KCKempf-Grote, AJKilgannon, PGallatin, WMOkasinski, GF Selective inhibition of ICAM-1 and E-selectin expression in human endothelial cells. 2. Aryl modifications of 4-(aryloxy)thieno[2,3-c]pyridines with fine-tuning at C-2 carbamides. J Med Chem44:3469-87 (2001) Intercellular adhesion molecule 1
Name:Intercellular adhesion molecule 1
Type:PROTEIN
Mol. Mass.:57831.10
Organism:Homo sapiens (Human)
Description:ChEMBL_826675
Residue:532
BDBM50105156
NameBDBM50105156
Synonyms:4-{4-[2-(2-Methoxy-ethoxy)-ethoxymethyl]-phenoxy}-thieno[2,3-c]pyridine-2-carboxylic acid methylamide | CHEMBL117279
TypeSmall organic molecule
Emp. Form.C21H24N2O5S
Mol. Mass.416.491
SMILESCNC(=O)c1cc2c(Oc3ccc(COCCOCCOC)cc3)cncc2s1