Reaction Details
TargetIntercellular adhesion molecule 1
LigandBDBM50105171
Substrate/Competitorn/a
Meas. Tech.ChEMBL_89057 (CHEMBL698938)
IC50 18±n/a nM
Citation Zhu, GDArendsen, DLGunawardana, IWBoyd, SAStewart, AOFry, DGCool, BLKifle, LSchaefer, VMeuth, JMarsh, KCKempf-Grote, AJKilgannon, PGallatin, WMOkasinski, GF Selective inhibition of ICAM-1 and E-selectin expression in human endothelial cells. 2. Aryl modifications of 4-(aryloxy)thieno[2,3-c]pyridines with fine-tuning at C-2 carbamides. J Med Chem44:3469-87 (2001) Intercellular adhesion molecule 1
Name:Intercellular adhesion molecule 1
Type:PROTEIN
Mol. Mass.:57831.10
Organism:Homo sapiens (Human)
Description:ChEMBL_826675
Residue:532
BDBM50105171
NameBDBM50105171
Synonyms:4-(2-Carbamoyl-thieno[2,3-c]pyridin-4-yloxy)-benzoic acid ethyl ester | CHEMBL116307
TypeSmall organic molecule
Emp. Form.C17H14N2O4S
Mol. Mass.342.369
SMILESCCOC(=O)c1ccc(Oc2cncc3sc(cc23)C(N)=O)cc1