Reaction Details
TargetVascular cell adhesion protein 1
LigandBDBM50105186
Substrate/Competitorn/a
Meas. Tech.ChEMBL_213809 (CHEMBL818854)
IC50>1000±n/a nM
Citation Zhu, GDArendsen, DLGunawardana, IWBoyd, SAStewart, AOFry, DGCool, BLKifle, LSchaefer, VMeuth, JMarsh, KCKempf-Grote, AJKilgannon, PGallatin, WMOkasinski, GF Selective inhibition of ICAM-1 and E-selectin expression in human endothelial cells. 2. Aryl modifications of 4-(aryloxy)thieno[2,3-c]pyridines with fine-tuning at C-2 carbamides. J Med Chem44:3469-87 (2001) Vascular cell adhesion protein 1
Name:Vascular cell adhesion protein 1
Type:Other Protein Type
Mol. Mass.:81259.16
Organism:Homo sapiens (Human)
Description:P19320
Residue:739
BDBM50105186
NameBDBM50105186
Synonyms:4-(4-Trifluoromethyl-phenoxy)-thieno[2,3-c]pyridine-2-carboxylic acid methylamide | CHEMBL119501
TypeSmall organic molecule
Emp. Form.C16H11F3N2O2S
Mol. Mass.352.331
SMILESCNC(=O)c1cc2c(Oc3ccc(cc3)C(F)(F)F)cncc2s1