Reaction Details
TargetE-selectin
LigandBDBM50105191
Substrate/Competitorn/a
Meas. Tech.ChEMBL_199699 (CHEMBL802927)
IC50 25±n/a nM
Citation Zhu, GDArendsen, DLGunawardana, IWBoyd, SAStewart, AOFry, DGCool, BLKifle, LSchaefer, VMeuth, JMarsh, KCKempf-Grote, AJKilgannon, PGallatin, WMOkasinski, GF Selective inhibition of ICAM-1 and E-selectin expression in human endothelial cells. 2. Aryl modifications of 4-(aryloxy)thieno[2,3-c]pyridines with fine-tuning at C-2 carbamides. J Med Chem44:3469-87 (2001) E-selectin
Name:E-selectin
Type:PROTEIN
Mol. Mass.:66642.96
Organism:Homo sapiens (Human)
Description:ChEMBL_1438995
Residue:610
BDBM50105191
NameBDBM50105191
Synonyms:4-[4-(3-Morpholin-4-yl-3-oxo-propenyl)-phenoxy]-thieno[2,3-c]pyridine-2-carboxylic acid amide | CHEMBL419046
TypeSmall organic molecule
Emp. Form.C21H19N3O4S
Mol. Mass.409.458
SMILESNC(=O)c1cc2c(Oc3ccc(\C=C\C(=O)N4CCOCC4)cc3)cncc2s1