Reaction Details
TargetReverse transcriptase/RNaseH
LigandBDBM50106919
Substrate/Competitorn/a
Meas. Tech.ChEBML_195690
EC50 4500±n/a nM
Citation Chamorro, CLobatón, EBonache, MCDe Clercq, EBalzarini, JVelázquez, SSan-Félix, ACamarasa, MJ Identification of a novel family of nucleosides that specifically inhibit HIV-1 reverse transcriptase. Bioorg Med Chem Lett11:3085-8 (2001) Reverse transcriptase/RNaseH
Name:Reverse transcriptase/RNaseH
Type:PROTEIN
Mol. Mass.:65229.15
Organism:Human immunodeficiency virus 1
Description:ChEMBL_1473730
Residue:566
BDBM50106919
NameBDBM50106919
Synonyms:CHEMBL105018 | {3-[3-(tert-Butyl-dimethyl-silanyloxy)-5-(tert-butyl-dimethyl-silanyloxymethyl)-tetrahydro-furan-2-yl]-5-methyl-2,6-dioxo-3,6-dihydro-2H-pyrimidin-1-yl}-acetic acid
TypeSmall organic molecule
Emp. Form.C24H44N2O7Si2
Mol. Mass.528.7864
SMILESCc1cn(C2OC(CO[Si](C)(C)C(C)(C)C)CC2O[Si](C)(C)C(C)(C)C)c(=O)n(CC(O)=O)c1=O