Reaction Details
TargetPlatelet-activating factor acetylhydrolase
LigandBDBM50107505
Substrate/Competitorn/a
Meas. Tech.ChEBML_101009
IC50 0.200000±n/a nM
Citation Boyd, HFFell, SCHickey, DMIfe, RJLeach, CAMacphee, CHMilliner, KJPinto, ILRawlings, DASmith, SAStansfield, IGStanway, SJTheobald, CJWhittaker, CM Potent, orally active inhibitors of lipoprotein-associated phospholipase A(2): 1-(biphenylmethylamidoalkyl)-pyrimidones. Bioorg Med Chem Lett12:51-5 (2001) Platelet-activating factor acetylhydrolase
Name:Platelet-activating factor acetylhydrolase
Type:PROTEIN
Mol. Mass.:50084.41
Organism:Homo sapiens (Human)
Description:ChEMBL_156212
Residue:441
BDBM50107505
NameBDBM50107505
Synonyms:CHEMBL79555 | N-(4'-Chloro-biphenyl-4-ylmethyl)-2-[2-(4-fluoro-benzylsulfanyl)-5-(2-methoxy-pyrimidin-5-ylmethyl)-4-oxo-4H-pyrimidin-1-yl]-N-methyl-acetamide
TypeSmall organic molecule
Emp. Form.C33H29ClFN5O3S
Mol. Mass.630.131
SMILESCOc1ncc(Cc2cn(CC(=O)N(C)Cc3ccc(cc3)-c3ccc(Cl)cc3)c(SCc3ccc(F)cc3)nc2=O)cn1