Reaction Details
TargetPeroxisome proliferator-activated receptor gamma
LigandBDBM28701
Substrate/Competitorn/a
Meas. Tech.ChEBML_154056
EC50>137000±n/a nM
Citation Miyachi, HNomura, MTanase, TTakahashi, YIde, TTsunoda, MMurakami, KAwano, K Design, synthesis and evaluation of substituted phenylpropanoic acid derivatives as peroxisome proliferator-activated receptor (PPAR) activators: novel human PPARalpha-selective activators. Bioorg Med Chem Lett12:77-80 (2001) Peroxisome proliferator-activated receptor gamma
Name:Peroxisome proliferator-activated receptor gamma
Type:Nuclear Receptor
Mol. Mass.:57613.46
Organism:Homo sapiens (Human)
Description:P37231
Residue:505
BDBM28701
NameBDBM28701
Synonyms:2-(4-{2-[(4-chlorophenyl)formamido]ethyl}phenoxy)-2-methylpropanoic acid Bezafibrate Cedur | Sklerofibrat
TypeSmall organic molecule
Emp. Form.C19H20ClNO4
Mol. Mass.361.819
SMILESCC(C)(Oc1ccc(CCNC(=O)c2ccc(Cl)cc2)cc1)C(O)=O