Reaction Details
TargetCytochrome P450 1B1
LigandBDBM50108048
Substrate/Competitorn/a
Meas. Tech.ChEMBL_51379 (CHEMBL663710)
IC50 2±n/a nM
Citation Kim, SKo, HPark, JEJung, SLee, SKChun, YJ Design, synthesis, and discovery of novel trans-stilbene analogues as potent and selective human cytochrome P450 1B1 inhibitors. J Med Chem45:160-4 (2001) Cytochrome P450 1B1
Name:Cytochrome P450 1B1
Type:PROTEIN
Mol. Mass.:60861.81
Organism:Homo sapiens (Human)
Description:ChEMBL_1474523
Residue:543
BDBM50108048
NameBDBM50108048
Synonyms:(E)-2-(3,5-dimethoxystyryl)thiophene 2-[2-(3,5-Dimethoxy-phenyl)-vinyl]-thiophene | CHEMBL42428
TypeSmall organic molecule
Emp. Form.C14H14O2S
Mol. Mass.246.325
SMILESCOc1cc(OC)cc(\C=C\c2cccs2)c1