Reaction Details
TargetCytochrome P450 1B1
LigandBDBM50108052
Substrate/Competitorn/a
Meas. Tech.ChEMBL_51379 (CHEMBL663710)
IC50 6±n/a nM
Citation Kim, SKo, HPark, JEJung, SLee, SKChun, YJ Design, synthesis, and discovery of novel trans-stilbene analogues as potent and selective human cytochrome P450 1B1 inhibitors. J Med Chem45:160-4 (2001) Cytochrome P450 1B1
Name:Cytochrome P450 1B1
Type:PROTEIN
Mol. Mass.:60861.81
Organism:Homo sapiens (Human)
Description:ChEMBL_1474523
Residue:543
BDBM50108052
NameBDBM50108052
Synonyms:1-[(E)-2-(3,5-dimethoxyphenyl)vinyl]-2,4-dimethoxybenzene trans-2,4,3',5'-tetramethoxystilbene
TypeSmall organic molecule
Emp. Form.C18H20O4
Mol. Mass.300.349
SMILESCOc1ccc(\C=C\c2cc(OC)cc(OC)c2)c(OC)c1