Reaction Details
TargetDelta-type opioid receptor
LigandBDBM50108437
Substrate/Competitorn/a
Meas. Tech.ChEBML_145327
IC50>10000±n/a nM
Citation Semple, GAndersson, BMChhajlani, VGeorgsson, JJohansson, MLindschoten, MPontén, FRosenquist, ASörensen, HSwanson, LSwanson, M 3-Aryl pyridone derivatives. Potent and selective kappa opioid receptor agonists. Bioorg Med Chem Lett12:197-200 (2001) Delta-type opioid receptor
Name:Delta-type opioid receptor
Type:G Protein-Coupled Receptor (GPCR)
Mol. Mass.:40382.98
Organism:Homo sapiens (Human)
Description:Competition binding assays were carried out using membrane preparations from transfected HN9.10 cells that constitutively expressed the delta opioid receptor.
Residue:372
BDBM50108437
NameBDBM50108437
Synonyms:3-(3-Nitro-phenyl)-1-(1-phenyl-2-pyrrolidin-1-yl-ethyl)-1H-pyridin-2-one | CHEMBL293619
TypeSmall organic molecule
Emp. Form.C23H23N3O3
Mol. Mass.389.447
SMILES[O-][N+](=O)c1cccc(c1)-c1cccn(C(CN2CCCC2)c2ccccc2)c1=O