Reaction Details
TargetMu-type opioid receptor
LigandBDBM50108444
Substrate/Competitorn/a
Meas. Tech.ChEBML_145604
IC50 1100±n/a nM
Citation Semple, GAndersson, BMChhajlani, VGeorgsson, JJohansson, MLindschoten, MPontén, FRosenquist, ASörensen, HSwanson, LSwanson, M 3-Aryl pyridone derivatives. Potent and selective kappa opioid receptor agonists. Bioorg Med Chem Lett12:197-200 (2001) Mu-type opioid receptor
Name:Mu-type opioid receptor
Type:G Protein-Coupled Receptor (GPCR)
Mol. Mass.:44789.51
Organism:Homo sapiens (Human)
Description:P35372
Residue:400
BDBM50108444
NameBDBM50108444
Synonyms:1-(1-Phenyl-2-pyrrolidin-1-yl-ethyl)-3-(4-trifluoromethoxy-phenyl)-1H-pyridin-2-one | CHEMBL61426
TypeSmall organic molecule
Emp. Form.C24H23F3N2O2
Mol. Mass.428.4468
SMILESFC(F)(F)Oc1ccc(cc1)-c1cccn(C(CN2CCCC2)c2ccccc2)c1=O