Reaction Details
TargetKappa-type opioid receptor
LigandBDBM50108436
Substrate/Competitorn/a
Meas. Tech.ChEBML_145109
IC50 2.3±n/a nM
Citation Semple, GAndersson, BMChhajlani, VGeorgsson, JJohansson, MLindschoten, MPontén, FRosenquist, ASörensen, HSwanson, LSwanson, M 3-Aryl pyridone derivatives. Potent and selective kappa opioid receptor agonists. Bioorg Med Chem Lett12:197-200 (2001) Kappa-type opioid receptor
Name:Kappa-type opioid receptor
Type:G Protein-Coupled Receptor (GPCR)
Mol. Mass.:42648.76
Organism:Homo sapiens (Human)
Description:P41145
Residue:380
BDBM50108436
NameBDBM50108436
Synonyms:3-(3,4-Dichloro-phenyl)-1-(1-phenyl-2-pyrrolidin-1-yl-ethyl)-1H-pyridin-2-one | CHEMBL61212
TypeSmall organic molecule
Emp. Form.C23H22Cl2N2O
Mol. Mass.413.34
SMILESClc1ccc(cc1Cl)-c1cccn(C(CN2CCCC2)c2ccccc2)c1=O