Reaction Details
TargetMu-type opioid receptor
LigandBDBM50108434
Substrate/Competitorn/a
Meas. Tech.ChEBML_145604
IC50 4280.0±n/a nM
Citation Semple, GAndersson, BMChhajlani, VGeorgsson, JJohansson, MLindschoten, MPontén, FRosenquist, ASörensen, HSwanson, LSwanson, M 3-Aryl pyridone derivatives. Potent and selective kappa opioid receptor agonists. Bioorg Med Chem Lett12:197-200 (2001) Mu-type opioid receptor
Name:Mu-type opioid receptor
Type:G Protein-Coupled Receptor (GPCR)
Mol. Mass.:44789.51
Organism:Homo sapiens (Human)
Description:P35372
Residue:400
BDBM50108434
NameBDBM50108434
Synonyms:3-[2-Oxo-1-(1-phenyl-2-pyrrolidin-1-yl-ethyl)-1,2-dihydro-pyridin-3-yl]-benzonitrile | CHEMBL64809
TypeSmall organic molecule
Emp. Form.C24H23N3O
Mol. Mass.369.4589
SMILESO=c1c(cccn1C(CN1CCCC1)c1ccccc1)-c1cccc(c1)C#N