Reaction Details
TargetGag-Pol polyprotein [489-587]
LigandBDBM4146
Substrate/Competitorn/a
Meas. Tech.ChEMBL_159462 (CHEMBL878769)
IC50 2.5±n/a nM
Citation Huang, XXu, LLuo, XFan, KJi, RPei, GChen, KJiang, H Elucidating the inhibiting mode of AHPBA derivatives against HIV-1 protease and building predictive 3D-QSAR models. J Med Chem45:333-43 (2002) Gag-Pol polyprotein [489-587]
Name:Gag-Pol polyprotein [489-587]
Type:Enzyme Subunit
Mol. Mass.:10781.16
Organism:Human immunodeficiency virus type 1
Description:P04585[489-587]
Residue:99
BDBM4146
NameBDBM4146
Synonyms:(2S,4S)-N-tert-butyl-4-chloro-1-[(2S,3S)-2-hydroxy-3-[(3-hydroxy-2,6-dimethylphenyl)formamido]-4-phenylbutanoyl]pyrrolidine-2-carboxamide AHPBA deriv. 31 | CHEMBL116723
TypeSmall organic molecule
Emp. Form.C28H36ClN3O5
Mol. Mass.530.056
SMILESCc1ccc(O)c(C)c1C(=O)N[C@@H](Cc1ccccc1)[C@H](O)C(=O)N1C[C@@H](Cl)C[C@H]1C(=O)NC(C)(C)C