Reaction Details
TargetVitamin D3 receptor
LigandBDBM50200182
Substrate/Competitorn/a
Meas. Tech.ChEMBL_2026879 (CHEMBL4681037)
EC50 0.100000±n/a nM
Citation Pellicciari, RPasseri, DDe Franco, FMostarda, SFilipponi, PColliva, CGadaleta, RMFranco, PCarotti, AMacchiarulo, ARoda, AMoschetta, AGioiello, A Discovery of 3?,7?,11?-Trihydroxy-6?-ethyl-5?-cholan-24-oic Acid (TC-100), a Novel Bile Acid as Potent and Highly Selective FXR Agonist for Enterohepatic Disorders. J Med Chem59:9201-9214 (2016) 
 
Vitamin D3 receptor
Name:Vitamin D3 receptor
Type:Protein
Mol. Mass.:48288.72
Organism:Homo sapiens (Human)
Description:P11473
Residue:427
BDBM50200182
NameBDBM50200182
Synonyms:(1S,3R,5Z,7E)-9,10-secocholesta-5,7,10(19)-triene-1,3,25-triol (1alpha,3beta,5Z,7E)-9,10-secocholesta-5,7,10(19)-triene-1,3,25-triol 1,25-DHCC 1alpha,25-dihydroxycholecalciferol CALCITRIOL | CHEMBL846
TypeSmall organic molecule
Emp. Form.C27H44O3
Mol. Mass.416.6365
SMILESC[C@H](CCCC(C)(C)O)[C@H]1CC[C@H]2\C(CCC[C@]12C)=C\C=C1\C[C@@H](O)C[C@H](O)C1=C