Reaction Details
TargetGag-Pol polyprotein [489-587]
LigandBDBM50219019
Substrate/Competitorn/a
Meas. Tech.ChEMBL_79961 (CHEMBL687732)
IC50<0.100000±n/a nM
Citation Cheng, YRano, TAHuening, TTZhang, FLu, ZSchleif, WAGabryelski, LOlsen, DBStahlhut, MKuo, LCLin, JHXu, XJin, LOlah, TVMcLoughlin, DAKing, RCChapman, KTTata, JR A combinatorial library of indinavir analogues and its in vitro and in vivo studies. Bioorg Med Chem Lett12:529-32 (2002) Gag-Pol polyprotein [489-587]
Name:Gag-Pol polyprotein [489-587]
Type:Enzyme Subunit
Mol. Mass.:10781.16
Organism:Human immunodeficiency virus type 1
Description:P04585[489-587]
Residue:99
BDBM50219019
NameBDBM50219019
Synonyms:CHEMBL422323
TypeSmall organic molecule
Emp. Form.C40H49F3N6O4S
Mol. Mass.766.915
SMILESCn1nc(cc1-c1ccc(CN2CCN(C[C@@H](O)C[C@@H](Cc3ccccc3)C(=O)N[C@@H]3[C@H](O)Cc4ccccc34)[C@@H](C2)C(=O)NC(C)(C)C)s1)C(F)(F)F