Reaction Details
TargetGenome polyprotein
LigandBDBM50109998
Substrate/Competitorn/a
Meas. Tech.ChEBML_143628
IC50 29±n/a nM
Citation Beevers, RCarr, MGJones, PSJordan, SKay, PBLazell, RCRaynham, TM Solution and solid-phase synthesis of potent inhibitors of hepatitis C virus NS3 proteinase. Bioorg Med Chem Lett12:641-3 (2002) Genome polyprotein
Name:Genome polyprotein
Type:Protein
Mol. Mass.:67067.41
Organism:Hepatitis C virus
Description:A3EZI9
Residue:631
BDBM50109998
NameBDBM50109998
Synonyms:(S)-N-[(S)-1-((S)-1-{(S)-1-[(S)-1-((S)-1-Aminooxalyl-pentylcarbamoyl)-3-methyl-butylcarbamoyl]-2,2-dimethyl-propylcarbamoyl}-2-o-tolyl-ethylcarbamoyl)-2-benzyloxy-ethyl]-3-(3-carboxy-propionylamino)-succinamic acid | CHEMBL347015
TypeSmall organic molecule
Emp. Form.C47H67N7O13
Mol. Mass.938.074
SMILESCCCC[C@H](NC(=O)[C@H](CC(C)C)NC(=O)[C@@H](NC(=O)[C@H](Cc1ccccc1C)NC(=O)[C@H](COCc1ccccc1)NC(=O)[C@H](CC(O)=O)NC(=O)CCC(O)=O)C(C)(C)C)C(=O)C(N)=O