Reaction Details
TargetGenome polyprotein
LigandBDBM50109999
Substrate/Competitorn/a
Meas. Tech.ChEBML_143628
IC50 11±n/a nM
Citation Beevers, RCarr, MGJones, PSJordan, SKay, PBLazell, RCRaynham, TM Solution and solid-phase synthesis of potent inhibitors of hepatitis C virus NS3 proteinase. Bioorg Med Chem Lett12:641-3 (2002) Genome polyprotein
Name:Genome polyprotein
Type:Protein
Mol. Mass.:67067.41
Organism:Hepatitis C virus
Description:A3EZI9
Residue:631
BDBM50109999
NameBDBM50109999
Synonyms:(S)-4-[(S)-3-Carboxy-2-(3-carboxy-propionylamino)-propionylamino]-4-[(S)-1-((S)-2,2-dimethyl-1-{(S)-3-methyl-1-[(S)-1-((S)-1-phenyl-propylaminooxalyl)-pentylcarbamoyl]-butylcarbamoyl}-propylcarbamoyl)-2-o-tolyl-ethylcarbamoyl]-butyric acid | CHEMBL216441
TypeSmall organic molecule
Emp. Form.C51H73N7O14
Mol. Mass.1008.1638
SMILESCCCC[C@H](NC(=O)[C@H](CC(C)C)NC(=O)[C@@H](NC(=O)[C@H](Cc1ccccc1C)NC(=O)[C@H](CCC(O)=O)NC(=O)[C@H](CC(O)=O)NC(=O)CCC(O)=O)C(C)(C)C)C(=O)C(=O)N[C@@H](CC)c1ccccc1