Reaction Details
TargetProteasome subunit beta type-8
LigandBDBM50550643
Substrate/Competitorn/a
Meas. Tech.ChEMBL_2027962 (CHEMBL4682120)
IC50 1.3±n/a nM
Citation Xie, SCGillett, DLSpillman, NJTsu, CLuth, MROttilie, SDuffy, SGould, AEHales, PSeager, BACharron, CLBruzzese, FYang, XZhao, XHuang, SCHutton, CABurrows, JNWinzeler, EAAvery, VMDick, LRTilley, L Target Validation and Identification of Novel Boronate Inhibitors of the Plasmodium falciparum Proteasome. J Med Chem61:10053-10066 (2018) 
 
Proteasome subunit beta type-8
Name:Proteasome subunit beta type-8
Type:PROTEIN
Mol. Mass.:30357.49
Organism:Homo sapiens (Human)
Description:ChEMBL_1446797
Residue:276
BDBM50550643
NameBDBM50550643
Synonyms:CHEMBL4749207
TypeSmall organic molecule
Emp. Form.C22H29BN2O5
Mol. Mass.412.287
SMILESCC(C)C[C@H](NC(=O)[C@H](Cc1ccccc1)NC(=O)Cc1ccc(O)cc1)B(O)O