Reaction Details
TargetProteasome subunit beta type-8
LigandBDBM50069989
Substrate/Competitorn/a
Meas. Tech.ChEMBL_2027962 (CHEMBL4682120)
IC50 2.0±n/a nM
Citation Xie, SCGillett, DLSpillman, NJTsu, CLuth, MROttilie, SDuffy, SGould, AEHales, PSeager, BACharron, CLBruzzese, FYang, XZhao, XHuang, SCHutton, CABurrows, JNWinzeler, EAAvery, VMDick, LRTilley, L Target Validation and Identification of Novel Boronate Inhibitors of the Plasmodium falciparum Proteasome. J Med Chem61:10053-10066 (2018) 
 
Proteasome subunit beta type-8
Name:Proteasome subunit beta type-8
Type:PROTEIN
Mol. Mass.:30357.49
Organism:Homo sapiens (Human)
Description:ChEMBL_1446797
Residue:276
BDBM50069989
NameBDBM50069989
Synonyms:(R)-3-methyl-1-((S)-3-phenyl-2-(pyrazine-2-carboxamido)propanamido)butylboronic acid BORTEZOMIB Dipeptidyl boronic acid derivative N-[(1R)-1-(DIHYDROXYBORYL)-3-METHYLBUTYL]-N-(PYRAZIN-2-YLCARBONYL)-L-PHENYLALANINAMIDE Peptidyl boronic acid derivative Velcade | cid_387447
TypeSmall organic molecule
Emp. Form.C19H25BN4O4
Mol. Mass.384.237
SMILESCC(C)C[C@H](NC(=O)[C@H](Cc1ccccc1)NC(=O)c1cnccn1)B(O)O