Reaction Details
TargetGonadotropin-releasing hormone receptor
LigandBDBM50110627
Substrate/Competitorn/a
Meas. Tech.ChEMBL_71455 (CHEMBL685984)
IC50 0.400000±n/a nM
Citation Young, JRHuang, SXWalsh, TFWyvratt, MJYang, YTYudkovitz, JBCui, JMount, GRRen, RNWu, TJShen, XLyons, KAMao, AHCarlin, JRKaranam, BVVincent, SHCheng, KGoulet, MT 2-Arylindoles as gonadotropin releasing hormone (GnRH) antagonists: optimization of the tryptamine side chain. Bioorg Med Chem Lett12:827-32 (2002) Gonadotropin-releasing hormone receptor
Name:Gonadotropin-releasing hormone receptor
Type:Enzyme
Mol. Mass.:37749.45
Organism:Homo sapiens (Human)
Description:P30968
Residue:328
BDBM50110627
NameBDBM50110627
Synonyms:1-(7-Aza-bicyclo[2.2.1]hept-7-yl)-2-(2-(3,5-dimethyl-phenyl)-3-{(S)-2-[2-(3H-imidazo[4,5-b]pyridin-6-yl)-ethylamino]-1-methyl-ethyl}-1H-indol-5-yl)-2-methyl-propan-1-one | CHEMBL166649
TypeSmall organic molecule
Emp. Form.C37H44N6O
Mol. Mass.588.7849
SMILESC[C@H](CNCCc1cnc2nc[nH]c2c1)c1c([nH]c2ccc(cc12)C(C)(C)C(=O)N1C2CCC1CC2)-c1cc(C)cc(C)c1