Reaction Details
TargetCytosolic phospholipase A2 beta
LigandBDBM50110871
Substrate/Competitorn/a
Meas. Tech.ChEMBL_156209 (CHEMBL767151)
IC50 74±n/a nM
Citation Connolly, SBennion, CBotterell, SCroshaw, PJHallam, CHardy, KHartopp, PJackson, CGKing, SJLawrence, LMete, AMurray, DRobinson, DHSmith, GMStein, LWalters, IWells, EWithnall, WJ Design and synthesis of a novel and potent series of inhibitors of cytosolic phospholipase A(2) based on a 1,3-disubstituted propan-2-one skeleton. J Med Chem45:1348-62 (2002) Cytosolic phospholipase A2 beta
Name:Cytosolic phospholipase A2 beta
Type:PROTEIN
Mol. Mass.:87967.69
Organism:Homo sapiens (Human)
Description:ChEMBL_156210
Residue:781
BDBM50110871
NameBDBM50110871
Synonyms:4-[3-(4-Decyloxy-phenoxy)-2-oxo-propoxy]-3-methoxy-benzoic acid | CHEMBL25900
TypeSmall organic molecule
Emp. Form.C27H36O7
Mol. Mass.472.5705
SMILESCCCCCCCCCCOc1ccc(OCC(=O)COc2ccc(cc2OC)C(O)=O)cc1