Reaction Details
TargetCytosolic phospholipase A2 beta
LigandBDBM50110846
Substrate/Competitorn/a
Meas. Tech.ChEMBL_156210 (CHEMBL767152)
IC50 30±n/a nM
Citation Connolly, SBennion, CBotterell, SCroshaw, PJHallam, CHardy, KHartopp, PJackson, CGKing, SJLawrence, LMete, AMurray, DRobinson, DHSmith, GMStein, LWalters, IWells, EWithnall, WJ Design and synthesis of a novel and potent series of inhibitors of cytosolic phospholipase A(2) based on a 1,3-disubstituted propan-2-one skeleton. J Med Chem45:1348-62 (2002) Cytosolic phospholipase A2 beta
Name:Cytosolic phospholipase A2 beta
Type:PROTEIN
Mol. Mass.:87967.69
Organism:Homo sapiens (Human)
Description:ChEMBL_156210
Residue:781
BDBM50110846
NameBDBM50110846
Synonyms:4-(3-(4-(decyloxy)phenoxy)-2-oxopropoxy)benzoic acid 4-[3-(4-Decyloxy-phenoxy)-2-oxo-propoxy]-benzoic acid(AR-C70484XX) | CHEMBL30108
TypeSmall organic molecule
Emp. Form.C26H34O6
Mol. Mass.442.5446
SMILESCCCCCCCCCCOc1ccc(OCC(=O)COc2ccc(cc2)C(O)=O)cc1