Reaction Details
TargetCytosolic phospholipase A2 beta
LigandBDBM50110875
Substrate/Competitorn/a
Meas. Tech.ChEMBL_156210 (CHEMBL767152)
IC50 30±n/a nM
Citation Connolly, SBennion, CBotterell, SCroshaw, PJHallam, CHardy, KHartopp, PJackson, CGKing, SJLawrence, LMete, AMurray, DRobinson, DHSmith, GMStein, LWalters, IWells, EWithnall, WJ Design and synthesis of a novel and potent series of inhibitors of cytosolic phospholipase A(2) based on a 1,3-disubstituted propan-2-one skeleton. J Med Chem45:1348-62 (2002) Cytosolic phospholipase A2 beta
Name:Cytosolic phospholipase A2 beta
Type:PROTEIN
Mol. Mass.:87967.69
Organism:Homo sapiens (Human)
Description:ChEMBL_156210
Residue:781
BDBM50110875
NameBDBM50110875
Synonyms:5-[3-(4-Decyloxy-phenoxy)-2-oxo-propoxy]-pentanoic acid | CHEMBL29515
TypeSmall organic molecule
Emp. Form.C24H38O6
Mol. Mass.422.5549
SMILESCCCCCCCCCCOc1ccc(OCC(=O)COCCCCC(O)=O)cc1