Reaction Details
TargetTyrosine-protein kinase Lck
LigandBDBM50111434
Substrate/Competitorn/a
Meas. Tech.ChEBML_221487
IC50>250000±n/a nM
Citation Song, YWang, JTeng, SFKesuma, DDeng, YDuan, JWang, JHQi, RZSim, MM Beta-carbolines as specific inhibitors of cyclin-dependent kinases. Bioorg Med Chem Lett12:1129-32 (2002) Tyrosine-protein kinase Lck
Name:Tyrosine-protein kinase Lck
Type:n/a
Mol. Mass.:57987.83
Organism:Homo sapiens (Human)
Description:P06239
Residue:509
BDBM50111434
NameBDBM50111434
Synonyms:1-(5-Methyl-1H-imidazol-4-yl)-9H-beta-carboline | CHEMBL273547
TypeSmall organic molecule
Emp. Form.C15H12N4
Mol. Mass.248.2826
SMILESCc1[nH]cnc1-c1[nH]ccc2c3ccccc3nc12