Reaction Details
TargetDioxygenase
LigandBDBM50111623
Substrate/Competitorn/a
Meas. Tech.ChEMBL_100831 (CHEMBL709763)
IC50>100000±n/a nM
Citation Han, SInoue, HTerada, TKamoda, SSaburi, YSekimata, KSaito, TKobayashi, MShinozaki, KYoshida, SAsami, T Design and synthesis of lignostilbene-alpha,beta-dioxygenase inhibitors. Bioorg Med Chem Lett12:1139-42 (2002) Dioxygenase
Name:Dioxygenase
Synonyms:Lignostilbene alpha, beta-dioxygenase
Type:PROTEIN
Mol. Mass.:14181.67
Organism:Pseudomonas paucimobilis
Description:ChEMBL_19606
Residue:128
BDBM50111623
NameBDBM50111623
TypeSmall organic molecule
Emp. Form.C14H11F
Mol. Mass.198.2355
SMILESF\C(=C/c1ccccc1)c1ccccc1