Reaction Details
TargetProthrombin
LigandBDBM50111722
Substrate/Competitorn/a
Meas. Tech.ChEBML_208494
Ki 31±n/a nM
Citation Reiner, JESiev, DVAraldi, GLCui, JJHo, JZReddy, KMMamedova, LVu, PHLee, KSMinami, NKGibson, TSAnderson, SMBradbury, AENolan, TGSemple, JE Non-covalent thrombin inhibitors featuring P(3)-heterocycles with P(1)-monocyclic arginine surrogates. Bioorg Med Chem Lett12:1203-8 (2002) Prothrombin
Name:Prothrombin
Type:Protein
Mol. Mass.:70029.57
Organism:Homo sapiens (Human)
Description:P00734
Residue:622
BDBM50111722
NameBDBM50111722
Synonyms:CHEMBL19644 | N-[5-(N-Hydroxycarbamimidoyl)-thiophen-2-ylmethyl]-2-(6-methyl-2-oxo-3-phenethylamino-2H-pyrazin-1-yl)-acetamide
TypeSmall organic molecule
Emp. Form.C21H24N6O3S
Mol. Mass.440.519
SMILESCc1cnc(NCCc2ccccc2)c(=O)n1CC(=O)NCc1ccc(s1)C(=N)NO