Reaction Details
TargetProthrombin
LigandBDBM50111714
Substrate/Competitorn/a
Meas. Tech.ChEBML_208494
Ki 1.6±n/a nM
Citation Reiner, JESiev, DVAraldi, GLCui, JJHo, JZReddy, KMMamedova, LVu, PHLee, KSMinami, NKGibson, TSAnderson, SMBradbury, AENolan, TGSemple, JE Non-covalent thrombin inhibitors featuring P(3)-heterocycles with P(1)-monocyclic arginine surrogates. Bioorg Med Chem Lett12:1203-8 (2002) Prothrombin
Name:Prothrombin
Type:Protein
Mol. Mass.:70029.57
Organism:Homo sapiens (Human)
Description:P00734
Residue:622
BDBM50111714
NameBDBM50111714
Synonyms:CHEMBL416912 | N-(4-Carbamimidoyl-2-methoxy-benzyl)-2-[3-(3-methoxy-benzenesulfonylamino)-2-oxo-2H-pyridin-1-yl]-acetamide
TypeSmall organic molecule
Emp. Form.C23H25N5O6S
Mol. Mass.499.54
SMILESCOc1cccc(c1)S(=O)(=O)Nc1cccn(CC(=O)NCc2ccc(cc2OC)C(N)=N)c1=O