Reaction Details
TargetCoagulation factor X
LigandBDBM50111728
Substrate/Competitorn/a
Meas. Tech.ChEBML_69664
Ki 1810±n/a nM
Citation Reiner, JESiev, DVAraldi, GLCui, JJHo, JZReddy, KMMamedova, LVu, PHLee, KSMinami, NKGibson, TSAnderson, SMBradbury, AENolan, TGSemple, JE Non-covalent thrombin inhibitors featuring P(3)-heterocycles with P(1)-monocyclic arginine surrogates. Bioorg Med Chem Lett12:1203-8 (2002) Coagulation factor X
Name:Coagulation factor X
Type:Enzyme
Mol. Mass.:54726.60
Organism:Homo sapiens (Human)
Description:n/a
Residue:488
BDBM50111728
NameBDBM50111728
Synonyms:4-Fluoro-2-({1-[((R)-1-formyl-4-guanidino-butylcarbamoyl)-methyl]-6-methyl-2-oxo-1,2-dihydro-pyridin-3-ylsulfamoyl}-methyl)-benzoic acid methyl ester | CHEMBL19831
TypeSmall organic molecule
Emp. Form.C23H29FN6O8S
Mol. Mass.568.575
SMILESCOC(=O)c1ccc(F)cc1CS(=O)(=O)Nc1ccc(C)n(CC(=O)N[C@H](CCCNC(N)=N)C(O)=O)c1=O