Reaction Details
TargetProto-oncogene tyrosine-protein kinase Src
LigandBDBM14687
Substrate/Competitorn/a
Meas. Tech.ChEBML_202783
IC50 4400000±n/a nM
Citation Deprez, PMandine, EGofflo, DMeunier, SLesuisse, D Small ligands interacting with the phosphotyrosine binding pocket of the Src SH2 protein. Bioorg Med Chem Lett12:1295-8 (2002) Proto-oncogene tyrosine-protein kinase Src
Name:Proto-oncogene tyrosine-protein kinase Src
Type:Protein
Mol. Mass.:59838.60
Organism:Homo sapiens (Human)
Description:P12931
Residue:536
BDBM14687
NameBDBM14687
Synonyms:CHEMBL284362 ISO24 [(4-ethylphenyl)carbamoyl]phosphonic acid
TypeSmall organic molecule
Emp. Form.C9H12NO4P
Mol. Mass.229.1696
SMILESCCc1ccc(NC(=O)P(O)(O)=O)cc1