Reaction Details
TargetProthrombin
LigandBDBM50113784
Substrate/Competitorn/a
Meas. Tech.ChEMBL_208531 (CHEMBL813625)
Ki 120±n/a nM
Citation Danilewicz, JCAbel, SMBrown, ADFish, PVHawkeswood, EHolland, SJJames, KMcElroy, ABOverington, JPowling, MJRance, DJ Design of selective thrombin inhibitors based on the (R)-Phe-Pro-Arg sequence. J Med Chem45:2432-53 (2002) Prothrombin
Name:Prothrombin
Type:Protein
Mol. Mass.:70029.57
Organism:Homo sapiens (Human)
Description:P00734
Residue:622
BDBM50113784
NameBDBM50113784
Synonyms:CHEMBL81844 | R-(2-{2-[2-(4-Carbamimidoyl-phenoxy)-ethyl]-piperidin-1-yl}-1-cyclohexylmethyl-2-oxo-ethylamino)-acetic acid
TypeSmall organic molecule
Emp. Form.C25H38N4O4
Mol. Mass.458.5936
SMILESNC(=N)c1ccc(OCC[C@H]2CCCCN2C(=O)[C@@H](CC2CCCCC2)NCC(O)=O)cc1