Reaction Details
TargetSerine protease 1
LigandBDBM50113797
Substrate/Competitorn/a
Meas. Tech.ChEMBL_212873 (CHEMBL817823)
Ki 9200±n/a nM
Citation Danilewicz, JCAbel, SMBrown, ADFish, PVHawkeswood, EHolland, SJJames, KMcElroy, ABOverington, JPowling, MJRance, DJ Design of selective thrombin inhibitors based on the (R)-Phe-Pro-Arg sequence. J Med Chem45:2432-53 (2002) Serine protease 1
Name:Serine protease 1
Type:Enzyme
Mol. Mass.:26557.80
Organism:Homo sapiens (Human)
Description:P07477
Residue:247
BDBM50113797
NameBDBM50113797
Synonyms:CHEMBL312479 | S-3-Benzylamino-4-{2-[2-(1-carbamimidoyl-piperidin-4-yloxy)-ethyl]-piperidin-1-yl}-4-oxo-butyric acid
TypeSmall organic molecule
Emp. Form.C24H37N5O4
Mol. Mass.459.5817
SMILESNC(=N)N1CCC(CC1)OCC[C@@H]1CCCCN1C(=O)[C@H](CC(O)=O)NCc1ccccc1