Reaction Details
TargetSerine protease 1
LigandBDBM50113799
Substrate/Competitorn/a
Meas. Tech.ChEMBL_212873 (CHEMBL817823)
Ki 700±n/a nM
Citation Danilewicz, JCAbel, SMBrown, ADFish, PVHawkeswood, EHolland, SJJames, KMcElroy, ABOverington, JPowling, MJRance, DJ Design of selective thrombin inhibitors based on the (R)-Phe-Pro-Arg sequence. J Med Chem45:2432-53 (2002) Serine protease 1
Name:Serine protease 1
Type:Enzyme
Mol. Mass.:26557.80
Organism:Homo sapiens (Human)
Description:P07477
Residue:247
BDBM50113799
NameBDBM50113799
Synonyms:CHEMBL309403 | S-4-{2-[2-(1-Carbamimidoyl-piperidin-4-yloxy)-ethyl]-piperidin-1-yl}-3-cycloheptylamino-4-oxo-butyric acid
TypeSmall organic molecule
Emp. Form.C24H43N5O4
Mol. Mass.465.6293
SMILESNC(=N)N1CCC(CC1)OCC[C@@H]1CCCCN1C(=O)[C@H](CC(O)=O)NC1CCCCCC1