Reaction Details
TargetProthrombin
LigandBDBM50113802
Substrate/Competitorn/a
Meas. Tech.ChEMBL_208531 (CHEMBL813625)
Ki 1.8±n/a nM
Citation Danilewicz, JCAbel, SMBrown, ADFish, PVHawkeswood, EHolland, SJJames, KMcElroy, ABOverington, JPowling, MJRance, DJ Design of selective thrombin inhibitors based on the (R)-Phe-Pro-Arg sequence. J Med Chem45:2432-53 (2002) Prothrombin
Name:Prothrombin
Type:Protein
Mol. Mass.:70029.57
Organism:Homo sapiens (Human)
Description:P00734
Residue:622
BDBM50113802
NameBDBM50113802
Synonyms:5-{2-[2-(1-Carbamimidoyl-piperidin-4-yloxy)-ethyl]-piperidin-1-yl}-4-(cyclohexyl-methyl-amino)-5-oxo-pentanoic acid | CHEMBL312647
TypeSmall organic molecule
Emp. Form.C25H45N5O4
Mol. Mass.479.6559
SMILESCN([C@@H](CCC(O)=O)C(=O)N1CCCC[C@H]1CCOC1CCN(CC1)C(N)=N)C1CCCCC1