Reaction Details
TargetVasopressin V1a receptor
LigandBDBM50108498
Substrate/Competitorn/a
Meas. Tech.ChEMBL_214412 (CHEMBL820276)
Ki 0.62±n/a nM
Citation Kakefuda, ASuzuki, TTobe, TTsukada, JTahara, ASakamoto, STsukamoto, S Synthesis and pharmacological evaluation of 5-(4-biphenyl)-3-methyl-4-phenyl-1,2,4-triazole derivatives as a novel class of selective antagonists for the human vasopressin V(1A) receptor. J Med Chem45:2589-98 (2002) Vasopressin V1a receptor
Name:Vasopressin V1a receptor
Type:Receptor
Mol. Mass.:46820.18
Organism:Homo sapiens (Human)
Description:P37288
Residue:418
BDBM50108498
NameBDBM50108498
Synonyms:Biphenyl-2-carboxylic acid (4-{5-[2-(4-dimethylamino-piperidin-1-yl)-2-oxo-ethylidene]-4,4-difluoro-2,3,4,5-tetrahydro-benzo[b]azepine-1-carbonyl}-phenyl)-amide | CHEMBL307483
TypeSmall organic molecule
Emp. Form.C39H38F2N4O3
Mol. Mass.648.7408
SMILESCN(C)C1CCN(CC1)C(=O)\C=C1\c2ccccc2N(CCC1(F)F)C(=O)c1ccc(NC(=O)c2ccccc2-c2ccccc2)cc1