Reaction Details
TargetMitogen-activated protein kinase 14
LigandBDBM50114234
Substrate/Competitorn/a
Meas. Tech.ChEBML_124642
IC50 290±n/a nM
Citation Dumas, JHatoum-Mokdad, HSibley, RNSmith, RAScott, WJKhire, ULee, WWood, JWolanin, DCooley, JBankston, DRedman, AMSchoenleber, RCaringal, YGunn, DRomero, ROsterhout, MPaulsen, HHousley, TJWilhelm, SMPirro, JChien, DSRanges, GEShrikhande, AMuzsi, ABortolon, EWakefield, JGianpaolo Ostravage, CBhargava, AChau, T Synthesis and pharmacological characterization of a potent, orally active p38 kinase inhibitor. Bioorg Med Chem Lett12:1559-62 (2002) Mitogen-activated protein kinase 14
Name:Mitogen-activated protein kinase 14
Type:Serine/threonine-protein kinase
Mol. Mass.:41286.76
Organism:Homo sapiens (Human)
Description:Q16539
Residue:360
BDBM50114234
NameBDBM50114234
Synonyms:1-[4-(4-Amino-benzyl)-phenyl]-3-(5-tert-butyl-2-methyl-2H-pyrazol-3-yl)-urea | CHEMBL39931
TypeSmall organic molecule
Emp. Form.C22H27N5O
Mol. Mass.377.4827
SMILESCn1nc(cc1NC(=O)Nc1ccc(Cc2ccc(N)cc2)cc1)C(C)(C)C