Reaction Details
TargetMitogen-activated protein kinase 14
LigandBDBM50114242
Substrate/Competitorn/a
Meas. Tech.ChEBML_124642
IC50 54±n/a nM
Citation Dumas, JHatoum-Mokdad, HSibley, RNSmith, RAScott, WJKhire, ULee, WWood, JWolanin, DCooley, JBankston, DRedman, AMSchoenleber, RCaringal, YGunn, DRomero, ROsterhout, MPaulsen, HHousley, TJWilhelm, SMPirro, JChien, DSRanges, GEShrikhande, AMuzsi, ABortolon, EWakefield, JGianpaolo Ostravage, CBhargava, AChau, T Synthesis and pharmacological characterization of a potent, orally active p38 kinase inhibitor. Bioorg Med Chem Lett12:1559-62 (2002) Mitogen-activated protein kinase 14
Name:Mitogen-activated protein kinase 14
Type:Serine/threonine-protein kinase
Mol. Mass.:41286.76
Organism:Homo sapiens (Human)
Description:Q16539
Residue:360
BDBM50114242
NameBDBM50114242
Synonyms:(4-{4-[3-(5-tert-Butyl-2-methyl-2H-pyrazol-3-yl)-ureido]-phenoxy}-phenyl)-carbamic acid isopropyl ester | CHEMBL288663
TypeSmall organic molecule
Emp. Form.C25H31N5O4
Mol. Mass.465.5447
SMILESCC(C)OC(=O)Nc1ccc(Oc2ccc(NC(=O)Nc3cc(nn3C)C(C)(C)C)cc2)cc1