Reaction Details
TargetMitogen-activated protein kinase 14
LigandBDBM50114246
Substrate/Competitorn/a
Meas. Tech.ChEBML_124642
IC50 200±n/a nM
Citation Dumas, JHatoum-Mokdad, HSibley, RNSmith, RAScott, WJKhire, ULee, WWood, JWolanin, DCooley, JBankston, DRedman, AMSchoenleber, RCaringal, YGunn, DRomero, ROsterhout, MPaulsen, HHousley, TJWilhelm, SMPirro, JChien, DSRanges, GEShrikhande, AMuzsi, ABortolon, EWakefield, JGianpaolo Ostravage, CBhargava, AChau, T Synthesis and pharmacological characterization of a potent, orally active p38 kinase inhibitor. Bioorg Med Chem Lett12:1559-62 (2002) Mitogen-activated protein kinase 14
Name:Mitogen-activated protein kinase 14
Type:Serine/threonine-protein kinase
Mol. Mass.:41286.76
Organism:Homo sapiens (Human)
Description:Q16539
Residue:360
BDBM50114246
NameBDBM50114246
Synonyms:CHEMBL40020 | N-(4-{4-[3-(5-tert-Butyl-2-methyl-2H-pyrazol-3-yl)-ureido]-benzyl}-phenyl)-succinamic acid
TypeSmall organic molecule
Emp. Form.C26H31N5O4
Mol. Mass.477.5554
SMILESCn1nc(cc1NC(=O)Nc1ccc(Cc2ccc(NC(=O)CCC(O)=O)cc2)cc1)C(C)(C)C