Reaction Details
TargetMitogen-activated protein kinase 14
LigandBDBM50091923
Substrate/Competitorn/a
Meas. Tech.ChEBML_124642
IC50 53±n/a nM
Citation Dumas, JHatoum-Mokdad, HSibley, RNSmith, RAScott, WJKhire, ULee, WWood, JWolanin, DCooley, JBankston, DRedman, AMSchoenleber, RCaringal, YGunn, DRomero, ROsterhout, MPaulsen, HHousley, TJWilhelm, SMPirro, JChien, DSRanges, GEShrikhande, AMuzsi, ABortolon, EWakefield, JGianpaolo Ostravage, CBhargava, AChau, T Synthesis and pharmacological characterization of a potent, orally active p38 kinase inhibitor. Bioorg Med Chem Lett12:1559-62 (2002) Mitogen-activated protein kinase 14
Name:Mitogen-activated protein kinase 14
Type:Serine/threonine-protein kinase
Mol. Mass.:41286.76
Organism:Homo sapiens (Human)
Description:Q16539
Residue:360
BDBM50091923
NameBDBM50091923
Synonyms:1-(5-tert-Butyl-2-methyl-2H-pyrazol-3-yl)-3-(2,3-dichloro-phenyl)-urea | CHEMBL41653
TypeSmall organic molecule
Emp. Form.C15H18Cl2N4O
Mol. Mass.341.236
SMILESCn1nc(cc1NC(=O)Nc1cccc(Cl)c1Cl)C(C)(C)C