Reaction Details
TargetMitogen-activated protein kinase 14
LigandBDBM50114238
Substrate/Competitorn/a
Meas. Tech.ChEBML_124642
IC50 57±n/a nM
Citation Dumas, JHatoum-Mokdad, HSibley, RNSmith, RAScott, WJKhire, ULee, WWood, JWolanin, DCooley, JBankston, DRedman, AMSchoenleber, RCaringal, YGunn, DRomero, ROsterhout, MPaulsen, HHousley, TJWilhelm, SMPirro, JChien, DSRanges, GEShrikhande, AMuzsi, ABortolon, EWakefield, JGianpaolo Ostravage, CBhargava, AChau, T Synthesis and pharmacological characterization of a potent, orally active p38 kinase inhibitor. Bioorg Med Chem Lett12:1559-62 (2002) Mitogen-activated protein kinase 14
Name:Mitogen-activated protein kinase 14
Type:Serine/threonine-protein kinase
Mol. Mass.:41286.76
Organism:Homo sapiens (Human)
Description:Q16539
Residue:360
BDBM50114238
NameBDBM50114238
Synonyms:1-(5-tert-Butyl-2-methyl-2H-pyrazol-3-yl)-3-[4-(4-propoxy-phenylsulfanyl)-phenyl]-urea | CHEMBL288891
TypeSmall organic molecule
Emp. Form.C24H30N4O2S
Mol. Mass.438.586
SMILESCCCOc1ccc(Sc2ccc(NC(=O)Nc3cc(nn3C)C(C)(C)C)cc2)cc1