Reaction Details
TargetMitogen-activated protein kinase 11
LigandBDBM50114250
Substrate/Competitorn/a
Meas. Tech.ChEBML_124651
IC50 110±n/a nM
Citation Dumas, JHatoum-Mokdad, HSibley, RNSmith, RAScott, WJKhire, ULee, WWood, JWolanin, DCooley, JBankston, DRedman, AMSchoenleber, RCaringal, YGunn, DRomero, ROsterhout, MPaulsen, HHousley, TJWilhelm, SMPirro, JChien, DSRanges, GEShrikhande, AMuzsi, ABortolon, EWakefield, JGianpaolo Ostravage, CBhargava, AChau, T Synthesis and pharmacological characterization of a potent, orally active p38 kinase inhibitor. Bioorg Med Chem Lett12:1559-62 (2002) Mitogen-activated protein kinase 11
Name:Mitogen-activated protein kinase 11
Type:Enzyme Catalytic Domain
Mol. Mass.:41351.73
Organism:Homo sapiens (Human)
Description:gi_20128774
Residue:364
BDBM50114250
NameBDBM50114250
Synonyms:1-(5-tert-Butyl-2-methyl-2H-pyrazol-3-yl)-3-(4-pyridin-4-ylmethyl-phenyl)-urea | CHEMBL288812
TypeSmall organic molecule
Emp. Form.C21H25N5O
Mol. Mass.363.4561
SMILESCn1nc(cc1NC(=O)Nc1ccc(Cc2ccncc2)cc1)C(C)(C)C