Reaction Details
TargetKallikrein-1
LigandBDBM50114446
Substrate/Competitorn/a
Meas. Tech.ChEBML_92367
IC50>11000±n/a nM
Citation Jia, ZJWu, YHuang, WGoldman, EZhang, PWoolfrey, JWong, PHuang, BSinha, UPark, GReed, AScarborough, RMZhu, BY Design, synthesis and biological activity of novel non-amidine factor Xa inhibitors. Part 1: P(1) structure-activity relationships of the substituted 1-(2-Naphthyl)-1H-pyrazole-5-carboxylamides. Bioorg Med Chem Lett12:1651-5 (2002) Kallikrein-1
Name:Kallikrein-1
Type:Enzyme
Mol. Mass.:28874.69
Organism:Homo sapiens (Human)
Description:P06870
Residue:262
BDBM50114446
NameBDBM50114446
Synonyms:5-Methyl-2-naphthalen-2-yl-2H-pyrazole-3-carboxylic acid (2'-sulfamoyl-biphenyl-4-yl)-amide | CHEMBL47250
TypeSmall organic molecule
Emp. Form.C27H22N4O3S
Mol. Mass.482.554
SMILESCc1cc(C(=O)Nc2ccc(cc2)-c2ccccc2S(N)(=O)=O)n(n1)-c1ccc2ccccc2c1