Reaction Details
TargetVitamin K-dependent protein C
LigandBDBM50114449
Substrate/Competitorn/a
Meas. Tech.ChEBML_27845
IC50>11000±n/a nM
Citation Jia, ZJWu, YHuang, WGoldman, EZhang, PWoolfrey, JWong, PHuang, BSinha, UPark, GReed, AScarborough, RMZhu, BY Design, synthesis and biological activity of novel non-amidine factor Xa inhibitors. Part 1: P(1) structure-activity relationships of the substituted 1-(2-Naphthyl)-1H-pyrazole-5-carboxylamides. Bioorg Med Chem Lett12:1651-5 (2002) Vitamin K-dependent protein C
Name:Vitamin K-dependent protein C
Type:Enzyme
Mol. Mass.:52067.73
Organism:Homo sapiens (Human)
Description:n/a
Residue:461
BDBM50114449
NameBDBM50114449
Synonyms:3-[3-Methyl-5-(2'-sulfamoyl-biphenyl-4-ylcarbamoyl)-pyrazol-1-yl]-naphthalene-2-carboxylic acid methyl ester | CHEMBL298259
TypeSmall organic molecule
Emp. Form.C29H24N4O5S
Mol. Mass.540.59
SMILESCOC(=O)c1cc2ccccc2cc1-n1nc(C)cc1C(=O)Nc1ccc(cc1)-c1ccccc1S(N)(=O)=O