Reaction Details
TargetSerine protease 1
LigandBDBM50114441
Substrate/Competitorn/a
Meas. Tech.ChEMBL_212715 (CHEMBL818174)
IC50>11000±n/a nM
Citation Jia, ZJWu, YHuang, WGoldman, EZhang, PWoolfrey, JWong, PHuang, BSinha, UPark, GReed, AScarborough, RMZhu, BY Design, synthesis and biological activity of novel non-amidine factor Xa inhibitors. Part 1: P(1) structure-activity relationships of the substituted 1-(2-Naphthyl)-1H-pyrazole-5-carboxylamides. Bioorg Med Chem Lett12:1651-5 (2002) Serine protease 1
Name:Serine protease 1
Type:Enzyme
Mol. Mass.:26557.80
Organism:Homo sapiens (Human)
Description:P07477
Residue:247
BDBM50114441
NameBDBM50114441
Synonyms:2-(6-Methoxy-naphthalen-2-yl)-5-methyl-2H-pyrazole-3-carboxylic acid (2'-sulfamoyl-biphenyl-4-yl)-amide | CHEMBL435765
TypeSmall organic molecule
Emp. Form.C28H24N4O4S
Mol. Mass.512.58
SMILESCOc1ccc2cc(ccc2c1)-n1nc(C)cc1C(=O)Nc1ccc(cc1)-c1ccccc1S(N)(=O)=O