Reaction Details
TargetPlatelet-derived growth factor receptor beta
LigandBDBM50115339
Substrate/Competitorn/a
Meas. Tech.ChEMBL_158524 (CHEMBL768951)
IC50 18200±n/a nM
Citation Matsuno, KIchimura, MNakajima, TTahara, KFujiwara, SKase, HUshiki, JGiese, NAPandey, AScarborough, RMLokker, NAYu, JCIrie, JTsukuda, EIde, SOda, SNomoto, Y Potent and selective inhibitors of platelet-derived growth factor receptor phosphorylation. 1. Synthesis, structure-activity relationship, and biological effects of a new class of quinazoline derivatives. J Med Chem45:3057-66 (2002) Platelet-derived growth factor receptor beta
Name:Platelet-derived growth factor receptor beta
Type:Enzyme
Mol. Mass.:123922.25
Organism:Homo sapiens (Human)
Description:P09619
Residue:1106
BDBM50115339
NameBDBM50115339
Synonyms:4-(6,7-Dimethoxy-quinazolin-4-yl)-piperazine-1-carbothioic acid benzo[1,3]dioxol-5-ylamide | CHEMBL104094
TypeSmall organic molecule
Emp. Form.C22H23N5O4S
Mol. Mass.453.514
SMILESCOc1cc2ncnc(N3CCN(CC3)C(=S)Nc3ccc4OCOc4c3)c2cc1OC